{"text_format":"1","workbook":"xlsx","n_sheets":11,"sheets":["Instructions","A - Summary","B - Personnel","C - Benefits & Taxes","D - Benefits & Taxes Narrative","E - Merit","F - Operations","G - Equipment","H - Equipment Narrative","I - Consultants","J - General Bud Info"],"not_rendered":{"charts":0,"images":0,"macros":1,"external_links":0,"defined_names":5,"comments":0,"pivot_tables":0},"unopened":[],"bounds":{"document_bytes":16777216,"sheet_cells":100000,"rows_first":2000,"rows_last":500,"rows_between":2000,"halvings":0,"cell_chars":16384,"cell_head_chars":4096},"cells_cut":0,"cells_raw":0,"read":"whole","date_system":"1900"}

{"sheet":"Instructions","index":0,"n_rows":46,"n_cols":4,"rows_kept":46,"cut":false,"hidden":false,"merged":[[1,0,1,4],[16,1,16,4],[20,1,20,4],[22,1,22,4],[25,1,25,4],[29,1,29,4],[23,1,23,4],[24,1,24,4],[26,1,26,4],[27,1,27,4],[45,2,45,4],[34,1,34,4],[38,1,38,4],[39,1,39,4],[30,1,30,4],[31,1,31,4],[32,1,32,4],[33,1,33,4],[36,1,36,4],[44,2,44,4],[40,1,40,4],[35,1,35,4],[37,1,37,4],[42,1,42,4],[41,1,41,4]]}
[]
["Please note: All calculations are rounded to the nearest whole dollar. Where input is required on your part, please round to the nearest whole dollar. For the purpose of this budget, use the category \"Community Services\" to record \"General Prevention and Diversion Programs referenced in the original RFP. "]
[null,"This file includes:"]
[1,null,"Instructions"]
[null,null,"Table A - Summary"]
[null,null,"9 Detail Tabs"]
{"$rows_left_out":41}
{"sheet":"A - Summary","index":1,"n_rows":34,"n_cols":16,"rows_kept":34,"cut":false,"hidden":false,"merged":[[18,1,18,8],[17,0,17,3],[17,5,17,15],[31,1,31,2],[31,3,31,14],[23,0,23,15],[21,1,21,15],[20,0,20,3],[0,0,0,15],[2,14,3,15],[2,0,4,0],[2,1,4,1],[2,4,2,5],[2,2,2,3],[2,12,2,13],[2,6,2,7],[2,8,2,9],[2,10,2,11]]}
[{"$f":"+\"Table A - Summary \" & FY","v":"Table A - Summary FY22"}]
["A","B","C","D","E","F","G","H","I","J","K","L","M","N","O","P"]
["Line","Category","Prevention",null,"Emergency Shelter",null,"CARS",null,"Life Skills",null,"FTOP",null,"Other Programs",null,"Total Costs"]
[null,null,"# of Clients",0,"# of Clients",0,"# of Clients",0,"# of Clients",0,"# of Clients",0,"# of Clients",0]
[null,null,"Amount","Percentage","Amount","Percentage","Amount","Percentage","Amount","Percentage","Amount","Percentage","Amount","Percentage","Amount","Percentage"]
[1," Personnel Programs",{"$f":"+'B - Personnel'!G36","v":0},{"$f":"IF(C6=0,0,C6/C$11)","v":0},{"$f":"+'B - Personnel'!I36","v":0},{"$f":"IF(E6=0,0,E6/E$11)","v":0},{"$f":"+'B - Personnel'!K36","v":0},{"$f":"IF(G6=0,0,G6/G$11)","v":0},{"$f":"+'B - Personnel'!M36","v":0},{"$f":"IF(I6=0,0,I6/I$11)","v":0},{"$f":"+'B - Personnel'!O36","v":0},{"$f":"IF(K6=0,0,K6/K$11)","v":0},{"$f":"+'B - Personnel'!Q36","v":0},{"$f":"IF(M6=0,0,M6/M$11)","v":0},{"$f":"+G6+M6+E6+C6+I6","v":0},{"$f":"IF(O6=0,0,O6/O$11)","v":0}]
{"$rows_left_out":29}
{"sheet":"B - Personnel","index":2,"n_rows":42,"n_cols":21,"rows_kept":42,"cut":false,"hidden":false,"merged":[[39,2,39,3],[40,2,40,3],[0,10,0,20],[4,18,4,20],[41,2,41,3],[0,1,0,6],[3,5,3,6],[3,11,3,12],[36,5,36,6],[36,7,36,8],[36,0,36,4],[40,5,40,17],[3,9,3,10],[1,1,1,16],[3,7,3,8],[3,15,3,16],[37,5,37,17],[3,13,3,14],[38,5,38,17],[38,2,38,3]]}
["FY22",{"$f":"IF(+'A - Summary'!$D32>0,+'A - Summary'!$D32,\"Please Enter Entity Name at the Bottom of Summary Sheet\")","v":"Please Enter Entity Name at the Bottom of Summary Sheet"},null,null,null,null,null,null,null,null,"If the alternating line shading is changed due to copying from one cell to another, then press \"Apply Alternant Line Shading\" button"]
[null,"Table B - Personnel  - Programs  DO NOT CUT OR MOVE ITEMS IN THIS SPREADSHEET"]
["A","B","C","D","E","F","G","H","I","J","K","L","M","N","O","P","Q","R","S","T","U"]
[null,null,null,null,null,"Prevention",null,"Shelter",null,"CARS",null,"Life Skills",null,"FTOP",null,"Other Prog.",null,"Tot%","Total Salary","Total B&T","Total"]
["Line","Position","FTE","Total Annual Salary","Benefits / Payroll Taxes","% Time","$ Amount","% Time","$ Amount","% Time","$ Amount","% Time","$ Amount","% Time","$ Amount","% Time","$ Amount",null,"Totals may not agree with individual amounts due to round-off error"]
[1,null,null,null,{"$f":"+'C - Benefits & Taxes'!T6","v":0},null,{"$f":"IF(($R6)<=1,+ROUND(F6*$C6*($D6+$E6),0),IF(F6=0,0,\"Error\"))","v":0},null,{"$f":"IF(($R6)<=1,+ROUND(H6*$C6*($D6+$E6),0),IF(H6=0,0,\"Error\"))","v":0},null,{"$f":"IF(($R6)<=1,+ROUND(J6*$C6*($D6+$E6),0),IF(J6=0,0,\"Error\"))","v":0},null,{"$f":"IF(($R6)<=1,+ROUND(L6*$C6*($D6+$E6),0),IF(L6=0,0,\"Error\"))","v":0},null,0,null,{"$f":"IF((ROUND(+$R6,0))<=1,+ROUND(P6*$C6*(D6+E6),0),IF(P6=0,0,\"ERROR\"))","v":0},{"$f":"+F6+H6+J6+L6+N6+P6","v":0},{"$f":"+D6*C6","v":0},{"$f":"+E6*C6","v":0},{"$f":"+S6+T6","v":0}]
{"$rows_left_out":37}
{"sheet":"C - Benefits & Taxes","index":3,"n_rows":38,"n_cols":20,"rows_kept":38,"cut":false,"hidden":false,"merged":[[0,1,0,6],[3,19,4,19],[37,0,37,8],[39,0,39,7],[3,0,4,0],[3,1,4,1],[3,3,4,3],[1,1,1,8],[0,9,1,19]]}
[null,{"$f":"IF(+'A - Summary'!$D32>0,+'A - Summary'!$D32,\"Please Enter Entity Name at the Bottom of Summary Sheet\")","v":"Please Enter Entity Name at the Bottom of Summary Sheet"},null,null,null,null,null,null,null,"If the alternating line shading has changed due to copying from one cell to another, then press \"Apply Alternating Line Shading\" button"]
[{"$f":"+FY","v":"FY22"},"Table C -  Benefits/Taxes DO NOT CUT OR MOVE WITHIN THIS SPREADSHEET"]
["A","B","C","D","E","F","G","H","I","J","K","L","M ","N","O","P","Q","R","S","T"]
["Line","Position",null,"Program Salary","Benefit 1:","Fica","Benefit 2:","Retirement","Benefit 3:","WC Ins.","Benefit 4:","Unemployment","Benefit 5:","Other","Monthly","Health Ins","Monthly","Other","Longevity","Total Benefits Cost (Formula)"]
[null,null,"FTE",null,"%","Amount","%","Amount","%","Amount","%","Amount","%","Amount","Rate 1","Amount","Rate 2","Amount","avg per FTE"]
[1,{"$f":"IF(+'B - Personnel'!B6<>0,+'B - Personnel'!B6,\"\")","v":""},{"$f":"+'B - Personnel'!C6","v":0},{"$f":"+'B - Personnel'!D6","v":0},null,{"$f":"ROUND((IF($D6=\" \",0,$D6*E6)),2)","v":0},null,{"$f":"ROUND((IF($D6=\" \",0,$D6*G6)),2)","v":0},null,{"$f":"ROUND((IF($D6=\" \",0,$D6*I6)),2)","v":0},null,0,null,{"$f":"ROUND((IF($D6=\" \",0,$D6*M6)),2)","v":0},null,{"$f":"ROUND(+O6*12,2)","v":0},null,{"$f":"ROUND(+Q6*12,2)","v":0},null,{"$f":"+F6+H6+J6+N6+P6+R6+S6+L6","v":0}]
{"$rows_left_out":33}
{"sheet":"D - Benefits & Taxes Narrative","index":4,"n_rows":3,"n_cols":7,"rows_kept":3,"cut":false,"hidden":false,"merged":[[5,0,5,12],[6,0,6,12],[2,0,2,12],[0,0,0,7],[3,0,3,12],[4,0,4,12]]}
[{"$f":"IF(+'A - Summary'!$D32>0,+'A - Summary'!$D32,\"Please Enter Entity Name at the Bottom of Summary Sheet\")","v":"Please Enter Entity Name at the Bottom of Summary Sheet"}]
["Table D - Benefits and Taxes Narrative",null,null,null,null,null,{"$f":"+FY","v":"FY22"}]
["1) Please describe your entity's benefits and taxes computations including a description of all components. If benefits vary by classification of employees, describe each class separately. Please do not expand the size of the boxes below - move to a new box if you run out of space. Attach additional pages as needed."]

{"sheet":"E - Merit","index":5,"n_rows":8,"n_cols":17,"rows_kept":8,"cut":false,"hidden":false,"merged":[[7,1,7,16],[0,0,0,7],[6,1,6,14],[0,9,0,16],[3,2,3,3],[3,4,3,5],[3,6,3,7],[3,8,3,9],[3,12,3,13],[3,10,3,11]]}
[{"$f":"IF(+'A - Summary'!$D32>0,+'A - Summary'!$D32,\"Please Enter Entity Name at the Bottom of Summary Sheet\")","v":"Please Enter Entity Name at the Bottom of Summary Sheet"},null,null,null,null,null,null,null,null,"Enter into light blue shaded areas"]
[{"$f":"+FY","v":"FY22"},"Table E - Merit pay estimate and Narrative DO NOT CUT OR MOVE ITEMS IN THIS SPREADSHEET"]
[{"$f":"+'G - Equipment'!A3","v":"A"},"B","C","D","E","F","G","H","I","J","K","L","M","N","O","P","Q"]
[null,null,{"$f":"+'G - Equipment'!D4","v":"Prevention"},null,"Shelter",null,"CARS",null,"Life Skills",null,"FTOP",null,"Other Programs",null,"Tot%","Total","Check"]
["Line","Merit Pay Total $","%","$ Amount","%","$ Amount","%","$ Amount","%","$ Amount","%","$ Amount","%","$ Amount"]
[1,null,null,{"$f":"IF(($O6)<=1,+ROUND(C6*$B6,0),IF(C6=0,\"\",\"Error\"))","v":0},null,{"$f":"IF(($O6)<=1,+ROUND(E6*$B6,0),IF(E6=0,\"\",\"Error\"))","v":0},null,{"$f":"IF(($O6)<=1,+ROUND(G6*$B6,0),IF(G6=0,\"\",\"Error\"))","v":0},null,{"$f":"IF(($O6)<=1,+ROUND(I6*$B6,0),IF(I6=0,\"\",\"Error\"))","v":0},null,0,null,{"$f":"IF(($O6)<=1,+ROUND(M6*$B6,0),IF(M6=0,\"\",\"Error\"))","v":0},{"$f":"+C6+E6+G6+M6+I6+K6","v":0},{"$f":"ROUND(+D6+F6+H6+J6+L6+N6,0)","v":0},{"$f":"IF(+P6-B6 = 0,\"Balanced\",P6-B6)","v":"Balanced"}]
{"$rows_left_out":3}
{"sheet":"F - Operations","index":6,"n_rows":42,"n_cols":18,"rows_kept":42,"cut":false,"hidden":false,"merged":[[0,1,0,6],[0,9,1,17],[3,7,3,8],[3,3,3,4],[3,5,3,6],[3,13,3,14],[3,9,3,10],[3,11,3,12]]}
[null,{"$f":"IF(+'A - Summary'!$D32>0,+'A - Summary'!$D32,\"Please Enter Entity Name at the Bottom of Summary Sheet\")","v":"Please Enter Entity Name at the Bottom of Summary Sheet"},null,null,null,null,null,null,null,"If the alternating line shading has changed due to copying from one cell to another, then press \"Apply Alternating Line Shading\" button"]
[{"$f":"+FY","v":"FY22"},"Table F - Operations DO NOT CUT OR MOVE ITEMS IN THIS SPREADSHEET"]
["A","B","C","D","E","F","G","H","I","J","K","L","M","N","O","P","Q","R"]
[null,null,null,{"$f":"+'B - Personnel'!F4","v":"Prevention"},null,"Shelter",null,"Cars",null,"Life Skills",null,"FTOP",null,"Other Programs",null,"Tot%","Total","Check"]
["Line","Description","Total Annual Cost","%","$ Amount","%","$ Amount","%","$ Amount","%","$ Amount","%","$ Amount","%","$ Amount"]
[1,null,null,{"$f":"IF(E6 = 0,0,+E6/$C6)","v":0},null,{"$f":"IF(G6 = 0,0,+G6/$C6)","v":0},null,{"$f":"IF(I6 = 0,0,+I6/$C6)","v":0},null,{"$f":"IF(K6 = 0,0,+K6/$C6)","v":0},null,{"$f":"IF(M6 = 0,0,+M6/$C6)","v":0},null,{"$f":"IF(O6 = 0,0,+O6/$C6)","v":0},null,{"$f":"IF(Q6 = 0,0,+Q6/$C6)","v":0},{"$f":"E6+G6+I6+K6+M6+O6","v":0},{"$f":"IF(ROUND(+E6+G6+I6+K6+M6+O6-C6,0) = 0,\"Balanced\",\"Error\")","v":"Balanced"}]
{"$rows_left_out":37}
{"sheet":"G - Equipment","index":7,"n_rows":36,"n_cols":18,"rows_kept":36,"cut":false,"hidden":false,"merged":[[0,1,0,6],[0,10,1,17],[3,9,3,10],[3,3,3,4],[3,5,3,6],[3,13,3,14],[3,7,3,8],[3,11,3,12]]}
[{"$f":"+FY","v":"FY22"},{"$f":"IF(+'A - Summary'!$D32>0,+'A - Summary'!$D32,\"Please Enter Entity Name at the Bottom of Summary Sheet\")","v":"Please Enter Entity Name at the Bottom of Summary Sheet"},null,null,null,null,null,null,null,null,"If the alternating line shading has changed due to copying from one cell to another, then press \"Apply Alternating Line Shading\" button"]
["Table G - Equipment DO NOT CUT OR MOVE ITEMS IN THIS SPREADSHEET"]
[{"$f":"+'F - Operations'!A3","v":"A"},{"$f":"+'F - Operations'!B3","v":"B"},{"$f":"+'F - Operations'!C3","v":"C"},{"$f":"+'F - Operations'!D3","v":"D"},{"$f":"+'F - Operations'!E3","v":"E"},{"$f":"+'F - Operations'!F3","v":"F"},{"$f":"+'F - Operations'!G3","v":"G"},{"$f":"+'F - Operations'!H3","v":"H"},{"$f":"+'F - Operations'!I3","v":"I"},"J","K","L","M",{"$f":"+'F - Operations'!N3","v":"N"},"O","P","Q","R"]
[null,null,null,{"$f":"+'F - Operations'!D4","v":"Prevention"},null,"Shelter",null,"Cars",null,"Life Skills",null,"FTOP",null,"Other Programs",null,"Tot%","Total","Check"]
["Line","Description","Total Cost","%","$ Amount","%","$ Amount","%","$ Amount","%","$ Amount","%","$ Amount","%","$ Amount"]
[1,null,null,null,{"$f":"IF((ROUND(+$P6,0))<=1,+ROUND(D6*$C6,0),IF(D6=0,0,\"ERROR\"))","v":0},null,{"$f":"IF((ROUND(+$P6,0))<=1,+ROUND(F6*$C6,0),IF(F6=0,0,\"ERROR\"))","v":0},null,{"$f":"IF((ROUND(+$P6,0))<=1,+ROUND(H6*$C6,0),IF(H6=0,0,\"ERROR\"))","v":0},null,{"$f":"IF((ROUND(+$P6,0))<=1,+ROUND(J6*$C6,0),IF(J6=0,0,\"ERROR\"))","v":0},null,{"$f":"IF((ROUND(+$P6,0))<=1,+ROUND(L6*$C6,0),IF(L6=0,0,\"ERROR\"))","v":0},null,{"$f":"IF((ROUND(+$P6,0))<=1,+ROUND(N6*$C6,0),IF(N6=0,0,\"ERROR\"))","v":0},{"$f":"+D6+H6+F6+N6+J6","v":0},{"$f":"ROUND(+E6+G6+I6+K6+M6+O6,0)","v":0},{"$f":"IF(+Q6-C6 = 0,\"Balanced\",Q6-C6)","v":"Balanced"}]
{"$rows_left_out":31}
{"sheet":"H - Equipment Narrative","index":8,"n_rows":10,"n_cols":12,"rows_kept":10,"cut":false,"hidden":false,"merged":[[0,0,0,10],[9,0,9,3],[4,0,4,6],[6,0,6,2],[7,0,7,1],[8,0,8,1],[5,0,5,10]]}
[{"$f":"IF(+'A - Summary'!$D32>0,+'A - Summary'!$D32,\"Please Enter Entity Name at the Bottom of Summary Sheet\")","v":"Please Enter Entity Name at the Bottom of Summary Sheet"},null,null,null,null,null,null,null,null,null,null,{"$f":"+FY","v":"FY22"}]
["Table H - Equipment Narrative - Item# _____________"]
["Please submit a separate sheet for each type of equipment to be purchased with OJA funds."]
[]
["1) Explain  how the equipment will be used for the program:"]
[]
{"$rows_left_out":5}
{"sheet":"I - Consultants","index":9,"n_rows":36,"n_cols":19,"rows_kept":36,"cut":false,"hidden":false,"merged":[[3,10,3,11],[0,1,0,5],[3,4,3,5],[3,14,3,15],[3,6,3,7],[3,8,3,9],[0,10,1,18],[3,12,3,13]]}
[{"$f":"+FY","v":"FY22"},{"$f":"IF(+'A - Summary'!$D32>0,+'A - Summary'!$D32,\"Please Enter Entity Name at the Bottom of Summary Sheet\")","v":"Please Enter Entity Name at the Bottom of Summary Sheet"},null,null,null,null,null,null,null,null,"If the alternating line shading has changed due to copying from one cell to another, then press \"Apply Alternating Line Shading\" button"]
["Table I - Consultant - Contractor DO NOT CUT OR MOVE ITEMS IN THIS SPREADSHEET"]
[{"$f":"+'G - Equipment'!A3","v":"A"},{"$f":"+'G - Equipment'!B3","v":"B"},{"$f":"+'G - Equipment'!C3","v":"C"},{"$f":"+'G - Equipment'!D3","v":"D"},{"$f":"+'G - Equipment'!E3","v":"E"},{"$f":"+'G - Equipment'!F3","v":"F"},{"$f":"+'G - Equipment'!G3","v":"G"},{"$f":"+'G - Equipment'!H3","v":"H"},{"$f":"+'G - Equipment'!I3","v":"I"},"J","K","L","M","N","O","P","Q","R","S"]
[null,null,null,null,{"$f":"+'G - Equipment'!D4","v":"Prevention"},null,"Shelter",null,"CARS",null,"Life Skills",null,"FTOP",null,"Other Programs",null,"Tot%","Total","Check"]
["Line","Name or Organization if known","Service Description","Total Cost","%","$ Amount","%","$ Amount","%","$ Amount","%","$ Amount","%","$ Amount","%","$ Amount"]
[1,null,null,null,null,{"$f":"IF(($Q6)<=1,+ROUND(E6*$D6,0),IF(E6=0,\"\",\"Error\"))","v":0},null,{"$f":"IF(($Q6)<=1,+ROUND(G6*$D6,0),IF(G6=0,\"\",\"Error\"))","v":0},null,{"$f":"IF(($Q6)<=1,+ROUND(I6*$D6,0),IF(I6=0,\"\",\"Error\"))","v":0},null,{"$f":"IF(($Q6)<=1,+ROUND(K6*$D6,0),IF(K6=0,\"\",\"Error\"))","v":0},null,0,null,{"$f":"IF(($Q6)<=1,+ROUND(O6*$D6,0),IF(O6=0,\"\",\"Error\"))","v":0},{"$f":"+E6+G6+I6+K6+M6+O6","v":0},{"$f":"ROUND(+F6+H6+J6+L6+N6+P6,0)","v":0},{"$f":"IF(+R6-D6 = 0,\"Balanced\",R6-D6)","v":"Balanced"}]
{"$rows_left_out":31}
{"sheet":"J - General Bud Info","index":10,"n_rows":20,"n_cols":256,"rows_kept":20,"cut":false,"hidden":false,"merged":[[0,1,0,9],[6,1,6,8],[18,7,18,8],[18,2,18,5],[17,1,17,12],[11,11,11,12],[12,11,12,12],[15,1,15,9],[11,1,12,8],[11,0,12,0],[9,1,9,8],[7,1,7,8],[3,0,4,0],[3,10,4,10],[10,0,10,12],[8,1,8,8],[3,11,3,12],[3,9,4,9],[3,1,4,8],[5,1,5,8]]}
[{"$f":"+FY","v":"FY22"},{"$f":"IF(+'A - Summary'!$D32>0,+'A - Summary'!$D32,\"Please Enter Entity Name at the Bottom of Summary Sheet\")","v":"Please Enter Entity Name at the Bottom of Summary Sheet"}]
["Table J - General Budget Information",null,null,null,null,null,null,null,null,null,null,null,null,"Table N - General Budget Information","Table N - General Budget Information","Table N - General Budget Information","Table N - General Budget Information","Table N - General Budget Information","Table N - General Budget Information","Table N - General Budget Information","Table N - General Budget Information","Table N - General Budget Information","Table N - General Budget Information","Table N - General Budget Information","Table N - General Budget Information","Table N - General Budget Information","Table N - General Budget Information","Table N - General Budget Information","Table N - General Budget Information","Table N - General Budget Information","Table N - General Budget Information","Table N - General Budget Information","Table N - General Budget Information","Table N - General Budget Information","Table N - General Budget Information","Table N - General Budget Information","Table N - General Budget Information","Table N - General Budget Information","Table N - General Budget Information","Table N - General Budget Information","Table N - General Budget Information","Table N - General Budget Information","Table N - General Budget Information","Table N - General Budget Information","Table N - General Budget Information","Table N - General Budget Information","Table N - General Budget Information","Table N - General Budget Information","Table N - General Budget Information","Table N - General Budget Information","Table N - General Budget Information","Table N - General Budget Information","Table N - General Budget Information","Table N - General Budget Information","Table N - General Budget Information","Table N - General Budget Information","Table N - General Budget Information","Table N - General Budget Information","Table N - General Budget Information","Table N - General Budget Information","Table N - General Budget Information","Table N - General Budget Information","Table N - General Budget Information","Table N - General Budget Information","Table N - General Budget Information","Table N - General Budget Information","Table N - General Budget Information","Table N - General Budget Information","Table N - General Budget Information","Table N - General Budget Information","Table N - General Budget Information","Table N - General Budget Information","Table N - General Budget Information","Table N - General Budget Information","Table N - General Budget Information","Table N - General Budget Information","Table N - General Budget Information","Table N - General Budget Information","Table N - General Budget Information","Table N - General Budget Information","Table N - General Budget Information","Table N - General Budget Information","Table N - General Budget Information","Table N - General Budget Information","Table N - General Budget Information","Table N - General Budget Information","Table N - General Budget Information","Table N - General Budget Information","Table N - General Budget Information","Table N - General Budget Information","Table N - General Budget Information","Table N - General Budget Information","Table N - General Budget Information","Table N - General Budget Information","Table N - General Budget Information","Table N - General Budget Information","Table N - General Budget Information","Table N - General Budget Information","Table N - General Budget Information","Table N - General Budget Information","Table N - General Budget Information","Table N - General Budget Information","Table N - General Budget Information","Table N - General Budget Information","Table N - General Budget Information","Table N - General Budget Information","Table N - General Budget Information","Table N - General Budget Information","Table N - General Budget Information","Table N - General Budget Information","Table N - General Budget Information","Table N - General Budget Information","Table N - General Budget Information","Table N - General Budget Information","Table N - General Budget Information","Table N - General Budget Information","Table N - General Budget Information","Table N - General Budget Information","Table N - General Budget Information","Table N - General Budget Information","Table N - General Budget Information","Table N - General Budget Information","Table N - General Budget Information","Table N - General Budget Information","Table N - General Budget Information","Table N - General Budget Information","Table N - General Budget Information","Table N - General Budget Information","Table N - General Budget Information","Table N - General Budget Information","Table N - General Budget Information","Table N - General Budget Information","Table N - General Budget Information","Table N - General Budget Information","Table N - General Budget Information","Table N - General Budget Information","Table N - General Budget Information","Table N - General Budget Information","Table N - General Budget Information","Table N - General Budget Information","Table N - General Budget Information","Table N - General Budget Information","Table N - General Budget Information","Table N - General Budget Information","Table N - General Budget Information","Table N - General Budget Information","Table N - General Budget Information","Table N - General Budget Information","Table N - General Budget Information","Table N - General Budget Information","Table N - General Budget Information","Table N - General Budget Information","Table N - General Budget Information","Table N - General Budget Information","Table N - General Budget Information","Table N - General Budget Information","Table N - General Budget Information","Table N - General Budget Information","Table N - General Budget Information","Table N - General Budget Information","Table N - General Budget Information","Table N - General Budget Information","Table N - General Budget Information","Table N - General Budget Information","Table N - General Budget Information","Table N - General Budget Information","Table N - General Budget Information","Table N - General Budget Information","Table N - General Budget Information","Table N - General Budget Information","Table N - General Budget Information","Table N - General Budget Information","Table N - General Budget Information","Table N - General Budget Information","Table N - General Budget Information","Table N - General Budget Information","Table N - General Budget Information","Table N - General Budget Information","Table N - General Budget Information","Table N - General Budget Information","Table N - General Budget Information","Table N - General Budget Information","Table N - General Budget Information","Table N - General Budget Information","Table N - General Budget Information","Table N - General Budget Information","Table N - General Budget Information","Table N - General Budget Information","Table N - General Budget Information","Table N - General Budget Information","Table N - General Budget Information","Table N - General Budget Information","Table N - General Budget Information","Table N - General Budget Information","Table N - General Budget Information","Table N - General Budget Information","Table N - General Budget Information","Table N - General Budget Information","Table N - General Budget Information","Table N - General Budget Information","Table N - General Budget Information","Table N - General Budget Information","Table N - General Budget Information","Table N - General Budget Information","Table N - General Budget Information","Table N - General Budget Information","Table N - General Budget Information","Table N - General Budget Information","Table N - General Budget Information","Table N - General Budget Information","Table N - General Budget Information","Table N - General Budget Information","Table N - General Budget Information","Table N - General Budget Information","Table N - General Budget Information","Table N - General Budget Information","Table N - General Budget Information","Table N - General Budget Information","Table N - General Budget Information","Table N - General Budget Information","Table N - General Budget Information","Table N - General Budget Information","Table N - General Budget Information","Table N - General Budget Information","Table N - General Budget Information","Table N - General Budget Information","Table N - General Budget Information","Table N - General Budget Information","Table N - General Budget Information","Table N - General Budget Information","Table N - General Budget Information","Table N - General Budget Information","Table N - General Budget Information","Table N - General Budget Information","Table N - General Budget Information","Table N - General Budget Information","Table N - General Budget Information","Table N - General Budget Information","Table N - General Budget Information","Table N - General Budget Information","Table N - General Budget Information","Table N - General Budget Information","Table N - General Budget Information","Table N - General Budget Information","Table N - General Budget Information","Table N - General Budget Information","Table N - General Budget Information","Table N - General Budget Information","Table N - General Budget Information","Table N - General Budget Information","Table N - General Budget Information","Table N - General Budget Information","Table N - General Budget Information","Table N - General Budget Information","Table N - General Budget Information","Table N - General Budget Information"]
["A","B","C","D","E","F","G","H","I","J","K","L","M"]
["Line ","Question",null,null,null,null,null,null,null,"Yes","No","State use only for verification of applicant's response"]
[null,null,null,null,null,null,null,null,null,null,null,"Date verified","Initials"]
[1,"Applicant has not been debarred or suspended by the federal government. (If \"No,\" attach an explanation)"]
{"$rows_left_out":14}